Mac OSX10.6.4でターミナルからのlftp-4.0.9インストール中にエラーが出ます。

エラーの解決方法、ヒントをご教授ください。
○過程でインストールしたもの
libgcrypt-1.4.6
libgpg-error-1.9
pkg-config-0.25
gnutls-2.10.0

○エラー内容(./configureの後、makeでエラー)
前半略
Job.h: In member function ‘void Job::ClearStatus()’:
Job.h:80: warning: format not a string literal and no format arguments
complete.cc: In function ‘char** lftp_completion(const char*, int, int)’:
complete.cc:623: error: ‘rl_ignore_some_completions_function’ was not declared in this scope
complete.cc:765: error: ‘rl_save_prompt’ was not declared in this scope
complete.cc:793: error: ‘rl_restore_prompt’ was not declared in this scope
complete.cc:794: error: ‘rl_clear_message’ was not declared in this scope
complete.cc:808: error: ‘rl_message’ was not declared in this scope
complete.cc:819: error: ‘rl_restore_prompt’ was not declared in this scope
complete.cc:820: error: ‘rl_clear_message’ was not declared in this scope
complete.cc: In function ‘char* bash_quote_filename(char*, int, char*)’:
complete.cc:1178: error: ‘MULT_MATCH’ was not declared in this scope
complete.cc: In function ‘int lftp_rl_getc(FILE*)’:
complete.cc:1257: error: ‘rl_kill_full_line’ was not declared in this scope
make[1]: *** [complete.o] Error 1
make: *** [all-recursive] Error 1

回答の条件
  • 1人2回まで
  • 13歳以上
  • 登録:2010/08/23 21:15:34
  • 終了:2010/08/30 21:20:02

回答(3件)

id:kick_m No.1

kick_m回答回数1372ベストアンサー獲得回数542010/08/23 22:37:11

一応、いま見てみましたら、わたしのmacに/usr/local/bin/lftpが入ってますね。だから入れられます。たぶんソースからコンパイルしたのだったと思いますが。

id:jojo_oraora

入れられることはわかっています。

きちんと質問に答えてください。

2010/08/23 23:32:25
id:ask002 No.2

ask002回答回数87ベストアンサー獲得回数02010/08/24 10:31:22

(はてなにより削除しました)
id:jojo_oraora

はてなさんご対応お願いします。

2010/08/24 10:41:06
id:yamaneroom No.3

yamaneroom回答回数1040ベストアンサー獲得回数612010/08/24 11:28:39

ポイント80pt

MacOSでコンパイルする場合は、下記を参照のこと。

http://www.mail-archive.com/lftp%40uniyar.ac.ru/msg02101.html

コメントはまだありません

この質問への反応(ブックマークコメント)

「あの人に答えてほしい」「この質問はあの人が答えられそう」というときに、回答リクエストを送ってみてましょう。

これ以上回答リクエストを送信することはできません。制限について

絞り込み :
はてなココの「ともだち」を表示します。
回答リクエストを送信したユーザーはいません