人力検索はてな
モバイル版を表示しています。PC版はこちら
i-mobile

Mac OSX10.6.4でターミナルからのlftp-4.0.9インストール中にエラーが出ます。
エラーの解決方法、ヒントをご教授ください。
○過程でインストールしたもの
libgcrypt-1.4.6
libgpg-error-1.9
pkg-config-0.25
gnutls-2.10.0

○エラー内容(./configureの後、makeでエラー)
前半略
Job.h: In member function ‘void Job::ClearStatus()’:
Job.h:80: warning: format not a string literal and no format arguments
complete.cc: In function ‘char** lftp_completion(const char*, int, int)’:
complete.cc:623: error: ‘rl_ignore_some_completions_function’ was not declared in this scope
complete.cc:765: error: ‘rl_save_prompt’ was not declared in this scope
complete.cc:793: error: ‘rl_restore_prompt’ was not declared in this scope
complete.cc:794: error: ‘rl_clear_message’ was not declared in this scope
complete.cc:808: error: ‘rl_message’ was not declared in this scope
complete.cc:819: error: ‘rl_restore_prompt’ was not declared in this scope
complete.cc:820: error: ‘rl_clear_message’ was not declared in this scope
complete.cc: In function ‘char* bash_quote_filename(char*, int, char*)’:
complete.cc:1178: error: ‘MULT_MATCH’ was not declared in this scope
complete.cc: In function ‘int lftp_rl_getc(FILE*)’:
complete.cc:1257: error: ‘rl_kill_full_line’ was not declared in this scope
make[1]: *** [complete.o] Error 1
make: *** [all-recursive] Error 1

●質問者: jojo_oraora
●カテゴリ:コンピュータ ウェブ制作
✍キーワード:623 808 ALL CC Char
○ 状態 :終了
└ 回答数 : 3/3件

▽最新の回答へ

1 ● kick_m
●0ポイント

一応、いま見てみましたら、わたしのmacに/usr/local/bin/lftpが入ってますね。だから入れられます。たぶんソースからコンパイルしたのだったと思いますが。

◎質問者からの返答

入れられることはわかっています。

きちんと質問に答えてください。


2 ● ask002
●0ポイント (はてなにより削除しました) ◎質問者からの返答

はてなさんご対応お願いします。


3 ● yamaneroom
●80ポイント

MacOSでコンパイルする場合は、下記を参照のこと。

http://www.mail-archive.com/lftp%40uniyar.ac.ru/msg02101.html

関連質問


●質問をもっと探す●



0.人力検索はてなトップ
8.このページを友達に紹介
9.このページの先頭へ
対応機種一覧
お問い合わせ
ヘルプ/お知らせ
ログイン
無料ユーザー登録
はてなトップ